NotationLong
sub property of: notation
definition: EXPERIMENTAL: Notation with blanks and leading zeros for sortability.

Further training
preferred label: Weiterbildung @de
NotationLong: BU06.02
scope note: (einschl.: Berufliche Fortbildung, Bildungsurlaub) @de
notation: BU06.02
broader: http://zbw.eu/beta/pm20voc/pr/i/72411
in scheme: pr
type: Concept