NotationLong
sub property of: notation
definition: EXPERIMENTAL: Notation with blanks and leading zeros for sortability.

Addiction
label: Sucht @de
type: Concept
in scheme: pr
scope note: (einschl.: Alkoholismus, Nikotinsucht) @de
notation: GE02
NotationLong: GE02
broader: http://zbw.eu/beta/pm20voc/pr/i/126713
narrower: http://zbw.eu/beta/pm20voc/pr/i/72405