NotationLong
sub property of: notation
definition: EXPERIMENTAL: Notation with blanks and leading zeros for sortability.

Health care system
broader: http://zbw.eu/beta/pm20voc/pr/i/126713
narrower: http://zbw.eu/beta/pm20voc/pr/i/72395
narrower: http://zbw.eu/beta/pm20voc/pr/i/72396
narrower: http://zbw.eu/beta/pm20voc/pr/i/72400
narrower: http://zbw.eu/beta/pm20voc/pr/i/72397
narrower: http://zbw.eu/beta/pm20voc/pr/i/72402
preferred label: Gesundheitswesen @de
type: Concept
notation: GE04
NotationLong: GE04
in scheme: pr
scope note: Gesundheitswesen im Sinne eines Wirtschaftssektors (einschl.: Gesundheitspolitik) @de