NotationLong
sub property of: notation
definition: EXPERIMENTAL: Notation with blanks and leading zeros for sortability.

Health personnel
label: Gesundheitsberufe @de
narrower: http://zbw.eu/beta/pm20voc/pr/i/72401
in scheme: pr
type: Concept
NotationLong: GE04.01
scope note: (einschl.: Heilpraktiker, Masseure, Krankengymnasten) @de
broader: http://zbw.eu/beta/pm20voc/pr/i/72403
notation: GE04.01