NotationLong
sub property of: notation
definition: EXPERIMENTAL: Notation with blanks and leading zeros for sortability.

Economy
type: Concept
scope note: (einschl.: Wirtschaftsstruktur, Wirtschaftsordnung, Wirtschaftssystem,Internationale Wettbewerbsfähigkeit, Infrastruktur,Infrastrukturpolitik, Ordnungspolitik, Deregulierung) @de
preferred label: Volkswirtschaft @de
in scheme: pr
notation: VW00
broader: http://zbw.eu/beta/pm20voc/pr/i/124348
NotationLong: VW00