National Accounts
preferred label: Volkswirtschaftliche Gesamtrechnung @de
NotationLong: VW02
scope note: (ausschl.: Für Prognosen vgl. aber: Wirtschaftslage) (einschl.: Produktivität, Sozialprodukt, Volkseinkommen) @de
broader: http://zbw.eu/beta/pm20voc/pr/i/124348
notation: VW02
in scheme: pr
type: Concept

NotationLong
sub property of: notation
definition: EXPERIMENTAL: Notation with blanks and leading zeros for sortability.