NotationLong
sub property of: notation
definition: EXPERIMENTAL: Notation with blanks and leading zeros for sortability.

Economic policy
scope note: (einschl.: Konjunkturpolitik, Wachstumspolitik) @de
in scheme: pr
preferred label: Wirtschaftspolitik @de
NotationLong: VW07
notation: VW07
narrower: http://zbw.eu/beta/pm20voc/pr/i/72370
broader: http://zbw.eu/beta/pm20voc/pr/i/124348
type: Concept