Hidden economy
label: Schattenwirtschaft @de
type: Concept
narrower: http://zbw.eu/beta/pm20voc/pr/i/72362
narrower: http://zbw.eu/beta/pm20voc/pr/i/72361
scope note: (einschl.: Schwarzmarkt, Informeller Sektor) @de
notation: VW11
broader: http://zbw.eu/beta/pm20voc/pr/i/124348
NotationLong: VW11
in scheme: pr

NotationLong
sub property of: notation
definition: EXPERIMENTAL: Notation with blanks and leading zeros for sortability.