Regional development
notation: VW12
label: Regionale Entwicklung @de
scope note: (einschl.: Regionalpolitik, regionale Wirtschaftsentwicklung, kommunale Wirtschaftspolitik, kommunale Wirtschaftsentwicklung) @de
broader: http://zbw.eu/beta/pm20voc/pr/i/124348
type: Concept
in scheme: pr
narrower: http://zbw.eu/beta/pm20voc/pr/i/72358
narrower: http://zbw.eu/beta/pm20voc/pr/i/72359
NotationLong: VW12

NotationLong
sub property of: notation
definition: EXPERIMENTAL: Notation with blanks and leading zeros for sortability.