NotationLong
sub property of: notation
definition: EXPERIMENTAL: Notation with blanks and leading zeros for sortability.

Financial services
broader: http://zbw.eu/beta/pm20voc/pr/i/124349
label: Finanzdienstleistung @de
in scheme: pr
NotationLong: GF06
type: Concept
notation: GF06
scope note: (einschl.: Allfinanz, Kapitalbeteiligungsgesellschaft, Venture-Capital-Anbieter, Rating-Agentur) @de