External sector
label: Außenwirtschaft @de
broader: http://zbw.eu/beta/pm20voc/pr/i/124350
notation: AW00
type: Concept
NotationLong: AW00
in scheme: pr
scope note: (einschl.: Außenwirtschaftspolitik, internationale Wirtschaftsgipfel) @de

NotationLong
sub property of: notation
definition: EXPERIMENTAL: Notation with blanks and leading zeros for sortability.