NotationLong
sub property of: notation
definition: EXPERIMENTAL: Notation with blanks and leading zeros for sortability.

Capital account
scope note: Staat als Kreditgegeber gegenüber dem Ausland (einschl.: Kapitalverkehrsbilanz, Internationaler Kapitalverkehr, Kapitalimport, Kapitalexport, Internationale Kapitalmobilität) @de
preferred label: Kapitalbilanz @de
narrower: http://zbw.eu/beta/pm20voc/pr/i/72336
in scheme: pr
type: Concept
notation: AW01.02
broader: http://zbw.eu/beta/pm20voc/pr/i/72339
NotationLong: AW01.02