NotationLong
sub property of: notation
definition: EXPERIMENTAL: Notation with blanks and leading zeros for sortability.

Foreign Trade
type: Concept
narrower: http://zbw.eu/beta/pm20voc/pr/i/72333
narrower: http://zbw.eu/beta/pm20voc/pr/i/72331
narrower: http://zbw.eu/beta/pm20voc/pr/i/72332
preferred label: Außenhandel @de
in scheme: pr
NotationLong: AW02
scope note: E-Commerce im Außenhandel (einschl.: Außenhandelspolitik, Internationales Handelsabkommen, Außenhandelskammer; E-Commerce im Außenhandel) @de
notation: AW02
broader: http://zbw.eu/beta/pm20voc/pr/i/124350