Balance of trade
label: Handelsbilanz @de
notation: AW02.02
broader: http://zbw.eu/beta/pm20voc/pr/i/72335
NotationLong: AW02.02
in scheme: pr
scope note: (ausschl.: Für Prognosen vgl. aber: Außenhandel) @de
type: Concept

NotationLong
sub property of: notation
definition: EXPERIMENTAL: Notation with blanks and leading zeros for sortability.