NotationLong
sub property of: notation
definition: EXPERIMENTAL: Notation with blanks and leading zeros for sortability.

International economic relations
in scheme: pr
label: Internationale Wirtschaftsbeziehungen @de
NotationLong: AW04
notation: AW04
scope note: (einschl.: Freihandelszone, Zollunion, Internationale Wirtschaftsintegration) @de
broader: http://zbw.eu/beta/pm20voc/pr/i/124350
type: Concept