Reparations
scope note: staatliche und private Kriegs- und Opferentschädigungen an Verfolgte und ehemalige Kriegsgegner, sowie an öffentliche und private internationale Organisationen (einschl.: Reparationen) @de
notation: OF06.02
preferred label: Wiedergutmachung @de
type: Concept
in scheme: pr
NotationLong: OF06.02
broader: http://zbw.eu/beta/pm20voc/pr/i/72308

NotationLong
sub property of: notation
definition: EXPERIMENTAL: Notation with blanks and leading zeros for sortability.