Workforce
notation: AR07
narrower: http://zbw.eu/beta/pm20voc/pr/i/72285
narrower: http://zbw.eu/beta/pm20voc/pr/i/72288
narrower: http://zbw.eu/beta/pm20voc/pr/i/72286
narrower: http://zbw.eu/beta/pm20voc/pr/i/72287
narrower: http://zbw.eu/beta/pm20voc/pr/i/72284
narrower: http://zbw.eu/beta/pm20voc/pr/i/72283
preferred label: Arbeitskräfte @de
broader: http://zbw.eu/beta/pm20voc/pr/i/126557
type: Concept
scope note: (einschl.: Arbeitnehmer, Angestellte, Arbeiter, Facharbeiter, Akademiker) @de
NotationLong: AR07
in scheme: pr

NotationLong
sub property of: notation
definition: EXPERIMENTAL: Notation with blanks and leading zeros for sortability.