NotationLong
sub property of: notation
definition: EXPERIMENTAL: Notation with blanks and leading zeros for sortability.

Managers
NotationLong: AR07.02
preferred label: Führungskräfte @de
type: Concept
broader: http://zbw.eu/beta/pm20voc/pr/i/72289
notation: AR07.02
in scheme: pr
scope note: (einschl.: Manager, leitende Angestellte) @de