NotationLong
sub property of: notation
definition: EXPERIMENTAL: Notation with blanks and leading zeros for sortability.

Child labour
broader: http://zbw.eu/beta/pm20voc/pr/i/72289
preferred label: Kinderarbeit @de
scope note: (einschl.: jugendliche Arbeitskräfte) @de
type: Concept
in scheme: pr
NotationLong: AR07.03
notation: AR07.03