NotationLong
sub property of: notation
definition: EXPERIMENTAL: Notation with blanks and leading zeros for sortability.

Disabled workers
notation: AR07.05
label: Behinderte Arbeitskräfte @de
NotationLong: AR07.05
type: Concept
broader: http://zbw.eu/beta/pm20voc/pr/i/72289
scope note: (ausschl.: für die Integration behinderter Menschen in Alltag und Beruf vgl. aber Behindertenpolitik) @de
in scheme: pr