NotationLong
sub property of: notation
definition: EXPERIMENTAL: Notation with blanks and leading zeros for sortability.

Foreign workers
preferred label: Ausländische Arbeitskräfte @de
in scheme: pr
NotationLong: AR07.06
broader: http://zbw.eu/beta/pm20voc/pr/i/72289
notation: AR07.06
scope note: (einschl.: internationale Arbeitsmobilität) @de
type: Concept