NotationLong
sub property of: notation
definition: EXPERIMENTAL: Notation with blanks and leading zeros for sortability.

Collective agreement
NotationLong: AR16
preferred label: Tarifvertrag @de
notation: AR16
scope note: (einschl.: Schlichtung, Sozialpartnerschaft, Tarifpolitik) @de
type: Concept
broader: http://zbw.eu/beta/pm20voc/pr/i/126557
in scheme: pr