Lohn
editorial note: Tariflohn, Tarifgehalt, wenn isoliert als Teil vom Tarifgeschehen thematisiert
scope note: (einschl.: Gehalt, Tariflohn, Tarifgehalt)
preferred label: Wages @en
narrower: http://zbw.eu/beta/pm20voc/pr/i/72278
notation: AR17
type: Concept
in scheme: pr
NotationLong: AR17
broader: http://zbw.eu/beta/pm20voc/pr/i/126557

NotationLong
sub property of: notation
definition: EXPERIMENTAL: Notation with blanks and leading zeros for sortability. @en