Unternehmensführung
type: Concept
scope note: (einschl.: Unternehmensentwicklung, Unternehmensplanung, Standortwahl, Unternehmensnachfolge)
narrower: http://zbw.eu/beta/pm20voc/pr/i/72269
narrower: http://zbw.eu/beta/pm20voc/pr/i/72271
narrower: http://zbw.eu/beta/pm20voc/pr/i/72268
narrower: http://zbw.eu/beta/pm20voc/pr/i/72270
narrower: http://zbw.eu/beta/pm20voc/pr/i/72267
in scheme: pr
NotationLong: BW01
notation: BW01
broader: http://zbw.eu/beta/pm20voc/pr/i/126573

NotationLong
sub property of: notation
definition: EXPERIMENTAL: Notation with blanks and leading zeros for sortability. @en