NotationLong
sub property of: notation
definition: EXPERIMENTAL: Notation with blanks and leading zeros for sortability.

Quality management
scope note: (einschl.: Betriebliches Vorschlagswesen) @de
preferred label: Qualitätsmanagement @de
NotationLong: BW01.04
in scheme: pr
type: Concept
notation: BW01.04
broader: http://zbw.eu/beta/pm20voc/pr/i/72273