NotationLong
sub property of: notation
definition: EXPERIMENTAL: Notation with blanks and leading zeros for sortability.

Business accounting
in scheme: pr
type: Concept
broader: http://zbw.eu/beta/pm20voc/pr/i/126573
preferred label: Betriebliches Rechnungswesen @de
notation: BW03
narrower: http://zbw.eu/beta/pm20voc/pr/i/72261
narrower: http://zbw.eu/beta/pm20voc/pr/i/72262
scope note: (einschl.: Jahresabschluß, Bilanzierung, Erfolgsrechnung, Betriebliche Kennzahlen) @de
NotationLong: BW03