Human Resource Management
NotationLong: BW05
scope note: (einschl.: Personalführung, Personalplanung, Personalentwicklung) @de
label: Personalmanagement @de
in scheme: pr
notation: BW05
type: Concept
narrower: http://zbw.eu/beta/pm20voc/pr/i/72257
broader: http://zbw.eu/beta/pm20voc/pr/i/126573

NotationLong
sub property of: notation
definition: EXPERIMENTAL: Notation with blanks and leading zeros for sortability.