NotationLong
sub property of: notation
definition: EXPERIMENTAL: Notation with blanks and leading zeros for sortability.

Logistics
preferred label: Logistik @de
type: Concept
notation: BW06.02
in scheme: pr
scope note: (einschl.: Betriebliche Lagerhaltung, betriebliches Transportwesen) @de
broader: http://zbw.eu/beta/pm20voc/pr/i/72256
NotationLong: BW06.02