Manufacturing system
scope note: (einschl.: Fertigungstechnik, Automatisierte Produktion, Materialprüfung) @de
NotationLong: BW07.01
broader: http://zbw.eu/beta/pm20voc/pr/i/72253
notation: BW07.01
preferred label: Fertigungssystem @de
in scheme: pr
type: Concept

NotationLong
sub property of: notation
definition: EXPERIMENTAL: Notation with blanks and leading zeros for sortability.