Product Management
label: Produktpolitik @de
notation: BW08.02
broader: http://zbw.eu/beta/pm20voc/pr/i/72251
type: Concept
in scheme: pr
scope note: (einschl.: Markenartikel, Produktinnovation) @de
NotationLong: BW08.02

NotationLong
sub property of: notation
definition: EXPERIMENTAL: Notation with blanks and leading zeros for sortability.