NotationLong
sub property of: notation
definition: EXPERIMENTAL: Notation with blanks and leading zeros for sortability.

Plant Production
label: Pflanzenbau @de
narrower: http://zbw.eu/beta/pm20voc/pr/i/72188
narrower: http://zbw.eu/beta/pm20voc/pr/i/73089
narrower: http://zbw.eu/beta/pm20voc/pr/i/73085
narrower: http://zbw.eu/beta/pm20voc/pr/i/72193
narrower: http://zbw.eu/beta/pm20voc/pr/i/72190
narrower: http://zbw.eu/beta/pm20voc/pr/i/72187
narrower: http://zbw.eu/beta/pm20voc/pr/i/73091
narrower: http://zbw.eu/beta/pm20voc/pr/i/72192
narrower: http://zbw.eu/beta/pm20voc/pr/i/73088
narrower: http://zbw.eu/beta/pm20voc/pr/i/72189
narrower: http://zbw.eu/beta/pm20voc/pr/i/73084
narrower: http://zbw.eu/beta/pm20voc/pr/i/72194
narrower: http://zbw.eu/beta/pm20voc/pr/i/73090
narrower: http://zbw.eu/beta/pm20voc/pr/i/73086
narrower: http://zbw.eu/beta/pm20voc/pr/i/72195
narrower: http://zbw.eu/beta/pm20voc/pr/i/73087
narrower: http://zbw.eu/beta/pm20voc/pr/i/73083
narrower: http://zbw.eu/beta/pm20voc/pr/i/72191
NotationLong: LW04
notation: LW04
type: Concept
scope note: (einschl.: Gartenbau, Ackerbau, Pflanzenbauprodukt, Gartenbauprodukt) @de
in scheme: pr
broader: http://zbw.eu/beta/pm20voc/pr/i/126584