NotationLong
sub property of: notation
definition: EXPERIMENTAL: Notation with blanks and leading zeros for sortability.

Fishery
label: Fischerei @de
notation: LW07
type: Concept
narrower: http://zbw.eu/beta/pm20voc/pr/i/73069
narrower: http://zbw.eu/beta/pm20voc/pr/i/73070
narrower: http://zbw.eu/beta/pm20voc/pr/i/73072
narrower: http://zbw.eu/beta/pm20voc/pr/i/73071
broader: http://zbw.eu/beta/pm20voc/pr/i/126584
scope note: (einschl.: Fischereiabkommen, Alge, Meeresprodukt, Fisch, Tiefkühlfisch) @de
in scheme: pr
NotationLong: LW07