Metal Mining
NotationLong: RB02.03
label: Erzbergbau @de
scope note: (einschl.: Eisenerzbergbau, NE-Metallerzbergbau, Eisenerz, Erz) @de
notation: RB02.03
broader: http://zbw.eu/beta/pm20voc/pr/i/72205
in scheme: pr
type: Concept

NotationLong
sub property of: notation
definition: EXPERIMENTAL: Notation with blanks and leading zeros for sortability.