NotationLong
sub property of: notation
definition: EXPERIMENTAL: Notation with blanks and leading zeros for sortability.

Regional authority
type: Concept
scope note: (einschl.: Gebietsreform, Provinzverwaltung, Landesverwaltung, Kreisverwaltung, Kommunalverwaltung, Stadtverwaltung, Paßangelegenheit, Ausweisangelegenheit) @de
label: Regionalverwaltung @de
NotationLong: OV03
in scheme: pr
notation: OV03
broader: http://zbw.eu/beta/pm20voc/pr/i/126689