NotationLong
sub property of: notation
definition: EXPERIMENTAL: Notation with blanks and leading zeros for sortability.

Drug
type: Concept
label: Droge @de
in scheme: pr
broader: http://zbw.eu/beta/pm20voc/pr/i/73055
notation: ID04-Dr
NotationLong: ID04-Dr
scope note: (ausschl.: vgl. aber Drogen als Heilmittel bei: pharmazeutisches Produkt) (einschl.: Betäubungsmittel, Rauschmittel) @de