Work of art
type: Concept
notation: ID04-Kg
preferred label: Kunstgegenstand @de
NotationLong: ID04-Kg
scope note: (einschl.: Antiquariat, Antiquität, Briefmarke, Medaille, Münze) @de
in scheme: pr
broader: http://zbw.eu/beta/pm20voc/pr/i/73055

NotationLong
sub property of: notation
definition: EXPERIMENTAL: Notation with blanks and leading zeros for sortability.