NotationLong
sub property of: notation
definition: EXPERIMENTAL: Notation with blanks and leading zeros for sortability.

Tooling machine
type: Concept
notation: ID08-Wz
broader: http://zbw.eu/beta/pm20voc/pr/i/73004
label: Werkzeugmaschine @de
NotationLong: ID08-Wz
scope note: (einschl.: Metallbearbeitungsmaschine) @de
in scheme: pr