NotationLong
sub property of: notation
definition: EXPERIMENTAL: Notation with blanks and leading zeros for sortability.

Specialty chemicals
type: Concept
preferred label: Spezialchemikalie @de
in scheme: pr
notation: ID13-Sp
scope note: (einschl.: Antioxidantien, Chemisches Hilfsmittel, Holzschutzmittel, Kältehilfsmittel, Konservierungsmittel, Rostschutzmittel) @de
NotationLong: ID13-Sp
broader: http://zbw.eu/beta/pm20voc/pr/i/72895