NotationLong
sub property of: notation
definition: EXPERIMENTAL: Notation with blanks and leading zeros for sortability.

Workwear
type: Concept
preferred label: Spezialbekleidung @de
notation: ID19-Sp
NotationLong: ID19-Sp
scope note: (einschl.: Arbeitsbekleidung, Berufsbekleidung, Schutzbekleidung) @de
in scheme: pr
broader: http://zbw.eu/beta/pm20voc/pr/i/72791