NotationLong
sub property of: notation
definition: EXPERIMENTAL: Notation with blanks and leading zeros for sortability.

Law
type: Concept
preferred label: Recht @de
notation: RE00
in scheme: pr
broader: http://zbw.eu/beta/pm20voc/pr/i/126756
NotationLong: RE00
narrower: http://zbw.eu/beta/pm20voc/pr/i/72702
scope note: (einschl.: Rechtssystem, Völkerrecht) @de