Constitution
type: Concept
label: Verfassung @de
broader: http://zbw.eu/beta/pm20voc/pr/i/126756
scope note: (einschl.: Verfassungsgericht, Staatssicherheit, Verfassungsrecht, Staatssymbol, Feiertagsordnung, Nationalflagge, Orden, Ehrenzeichen, Titel) @de
in scheme: pr
notation: RE01
NotationLong: RE01
narrower: http://zbw.eu/beta/pm20voc/pr/i/72700

NotationLong
sub property of: notation
definition: EXPERIMENTAL: Notation with blanks and leading zeros for sortability.