Climate protection
type: Concept
preferred label: Klimaschutz @de
broader: http://zbw.eu/beta/pm20voc/pr/i/72686
notation: NU02.03
scope note: (ausschl.: Für Klimaforschung und Meteorologie vgl. aber: Geowissenschaft) (einschl.: Luftverunreinigung, Luftreinhaltung) @de
in scheme: pr
NotationLong: NU02.03

NotationLong
sub property of: notation
definition: EXPERIMENTAL: Notation with blanks and leading zeros for sortability.