NotationLong
sub property of: notation
definition: EXPERIMENTAL: Notation with blanks and leading zeros for sortability.

Soil conservation
type: Concept
notation: NU02.04
label: Bodenschutz @de
broader: http://zbw.eu/beta/pm20voc/pr/i/72686
scope note: (einschl.: Bodenbelastung, Bodenerosion, Wüstenbildung) @de
in scheme: pr
NotationLong: NU02.04