NotationLong
sub property of: notation
definition: EXPERIMENTAL: Notation with blanks and leading zeros for sortability.

Cultural Industries
type: Concept
preferred label: Kultursektor @de
NotationLong: KU00
broader: http://zbw.eu/beta/pm20voc/pr/i/126729
in scheme: pr
notation: KU00
scope note: (einschl.: Kulturpolitik, Kulturzentren, Kulturgüter, Denkmalschutz, Denkmalpflege) @de