Family policy
type: Concept
scope note: (einschl.: Familienfürsorge des Staates,Erziehungsurlaub, Mutterschutz, Kindergeld) @de
in scheme: pr
NotationLong: SO02
broader: http://zbw.eu/beta/pm20voc/pr/i/126719
preferred label: Familienpolitik @de
notation: SO02
narrower: http://zbw.eu/beta/pm20voc/pr/i/72594

NotationLong
sub property of: notation
definition: EXPERIMENTAL: Notation with blanks and leading zeros for sortability.