NotationLong
sub property of: notation
definition: EXPERIMENTAL: Notation with blanks and leading zeros for sortability.

Traffic
type: Concept
broader: http://zbw.eu/beta/pm20voc/pr/i/126650
NotationLong: VK00
label: Verkehr @de
in scheme: pr
editorial note: betr. Verkehrsstatistik, Verkehrsaufkommen, Verkehrsinfrastruktur, Verkehrsleistung, Verkehrsprognose für einzelne Verkehrsträger vgl. entspr. Oberposition @de
scope note: (einschl.: Verkehrsstatistik, Verkehrsaufkommen, Verkehrsinfrastruktur, Verkehrsleistung, Verkehrsprognose) @de
notation: VK00