NotationLong
sub property of: notation
definition: EXPERIMENTAL: Notation with blanks and leading zeros for sortability.

Transport Policy
type: Concept
in scheme: pr
label: Verkehrspolitik @de
NotationLong: VK01
broader: http://zbw.eu/beta/pm20voc/pr/i/126650
notation: VK01
scope note: Privatisierung öffentlicher Verkehrsunternehmen @de