Passenger road traffic
type: Concept
preferred label: Straßenpersonenverkehr @de
notation: VK06.03
scope note: (einschl.: Omnibusverkehr, PKW-Verkehr, nicht-motorisierter Straßenpersonenverkehr) @de
broader: http://zbw.eu/beta/pm20voc/pr/i/72567
in scheme: pr
NotationLong: VK06.03

NotationLong
sub property of: notation
definition: EXPERIMENTAL: Notation with blanks and leading zeros for sortability.