NotationLong
sub property of: notation
definition: EXPERIMENTAL: Notation with blanks and leading zeros for sortability.

Shipping
type: Concept
notation: VK07
narrower: http://zbw.eu/beta/pm20voc/pr/i/72545
narrower: http://zbw.eu/beta/pm20voc/pr/i/72549
narrower: http://zbw.eu/beta/pm20voc/pr/i/72548
narrower: http://zbw.eu/beta/pm20voc/pr/i/72544
narrower: http://zbw.eu/beta/pm20voc/pr/i/72543
scope note: (einschl.: Seeschiffahrt, Schiffsregister) @de
broader: http://zbw.eu/beta/pm20voc/pr/i/126650
preferred label: Schifffahrt @de
NotationLong: VK07
in scheme: pr