NotationLong
sub property of: notation
definition: EXPERIMENTAL: Notation with blanks and leading zeros for sortability.

Social services
type: Concept
preferred label: Sozialer Dienst @de
scope note: Soziale Dienste privater und staatlicher Träger (einschl.: Kirchliche Sozialarbeit, Pflegedienst, Ambulante Pflege) @de
in scheme: pr
broader: http://zbw.eu/beta/pm20voc/pr/i/126719
narrower: http://zbw.eu/beta/pm20voc/pr/i/72546
notation: SO07
NotationLong: SO07